救救小白吧!!ss5安装编译时出错

已经把所有依赖都装了,百度找的yum install gcc openldap-devel pam-devel openssl-devel也装了,就是不行,求大佬解决

[[email protected] ss5-3.8.9]# make
make[1]: 进入目录“/root/ss5-3.8.9/common”
make[1]: 对“all”无需做任何事。
make[1]: 离开目录“/root/ss5-3.8.9/common”
make[1]: 进入目录“/root/ss5-3.8.9/modules”
make[2]: 进入目录“/root/ss5-3.8.9/modules/mod_socks4”
make[2]: 对“all”无需做任何事。
make[2]: 离开目录“/root/ss5-3.8.9/modules/mod_socks4”
make[2]: 进入目录“/root/ss5-3.8.9/modules/mod_socks5”
make[2]: 对“all”无需做任何事。
make[2]: 离开目录“/root/ss5-3.8.9/modules/mod_socks5”
make[2]: 进入目录“/root/ss5-3.8.9/modules/mod_authen”
gcc -g -O2 -DLINUX -D_FILE_OFFSET_BITS=64 -I . -I ../../include -shared -fPIC -c -o SS5Supa.o SS5Supa.c
SS5Supa.c: 在函数‘ss5_secure_dh_compute_key’中:
SS5Supa.c:208:5: 错误:dereferencing pointer to incomplete type ‘DH’ {或称 ‘struct dh_st’}
ss->p = BN_bin2bn ((pippo->p), pippo->lenp, NULL);
^~
SS5Supa.c: 在函数‘ss5_secure_dh_decrypt_key’中:
SS5Supa.c:342:3: 警告:implicit declaration of function ‘DES_ede3_cbcm_encrypt’; did you mean ‘DES_ede3_cbc_encrypt’? [-Wimplicit-function-declaration]
DES_ede3_cbcm_encrypt (pippo, pippo_crypt, l, &schedule1, &schedule2, &schedule1, &iv, &iv2, DES_DECRYPT);
^~~~~~~~~~~~~~~~~~~~~
DES_ede3_cbc_encrypt
In file included from SS5Supa.c:21:
SS5Supa.c: 在文件作用域:
../../include/SS5Mod_authentication.h:71:3: 警告:内联函数‘S5AuthCacheHash’声明过但从未定义
S5AuthCacheHash( char *u,
^~~~~~~~~~~~~~~
make[2]: *** [:SS5Supa.o] 错误 1
make[2]: 离开目录“/root/ss5-3.8.9/modules/mod_authen”
make[1]: *** [Makefile:6:all] 错误 1
make[1]: 离开目录“/root/ss5-3.8.9/modules”
make: *** [Makefile:27:modules] 错误 2

-> 加入科技玩家交流群组:点击加入 注意:
1.文中二维码和链接可能带有邀请性质,请各位玩家自行抉择。
2.请勿通过链接填写qq号与密码、银行卡号与密码等个人隐私信息。
3.禁止纯拉人头,拉app注册等信息,发现必小黑屋。
4.同一种信息仅发一次,多发会被删除。
5.文章中源码或APP等,无法保证其绝对安全,需自行辨别。
6.文章关联方不想展示也可以微信站长“socutesheep”删除。
本文由 @烂泥 发布。如若转载,请注明出处: 科技玩家 » 救救小白吧!!ss5安装编译时出错

圈主 管理员

热门评论
:
该帖子评论已关闭
图片审查中...
编辑答案: 我的回答: 最多上传一张图片和一个附件
x
x
个人中心
购物车
优惠劵
今日签到
有新私信 私信列表
搜索